{"text_format":"1","workbook":"xlsx","n_sheets":10,"sheets":["Intro.","Macros","Worksht1 - Field Flow","Worksht2 - Pump Sizing","Parts List ","T1-Dripline","T2-Filter & Headworks","T3-Valves","T4-PVC PLUS","T5-Flow meter"],"not_rendered":{"charts":0,"images":13,"macros":1,"external_links":2,"defined_names":7,"comments":4,"pivot_tables":0},"unopened":[],"bounds":{"document_bytes":16777216,"sheet_cells":100000,"rows_first":2000,"rows_last":500,"rows_between":2000,"halvings":0,"cell_chars":16384,"cell_head_chars":4096},"cells_cut":0,"cells_raw":0,"read":"whole","date_system":"1900"}

{"sheet":"Intro.","index":0,"n_rows":29,"n_cols":16,"rows_kept":29,"cut":false,"hidden":false,"merged":[]}
[]
[]
[]
[null,null,null,null,null,null,null,null,null,null,null,null,null,null,null,"Updated Jan. 2015"]
[null,"Basic Design Spreadsheet for Small Residential Systems"]
[]
[null,null,"This spreadsheet serves as a guide for small systems, and is not a complete hydraulic design.  Please check parameters for large systems."]
[]
[null,null,"The green tabs below are the worksheets, and the purple tabs are the tables including parts data."]
[null,null,"Shaded cells on the worksheets ","require inputs from you. ",null,null,null,null,"shaded"," unshaded"]
[null,null,"Scroll mouse over small red flags to see associated Notes"]
[]
[null,null,"\"Worksheet 1 - Field Calculation\" is your starting point.  It will help you determine how much flow is required"]
[null,null,"to disperse a given amount of effluent in a given soil.  These calculations are based on using secondary treated wastewater."]
[null,null,"You can play with the dripline and spacing to increase or decrease the flow per minute."]
[null,null,"Note at the bottom of this worksheet is a small spreadsheet used to determine if there is enough time in the day to disperse the effluent with"]
[null,null,"the chosen zone, dripline and spacing configurations."]
[null,null,"This program makes the assumption that all zones are equal in size.  If not, run the program zone by zone "]
[]
[null,null,"\"Worksheet 2 - Pump Sizing\" adds the pressure required to the flow rates as figured in Worksheet 1 so pumps can be selected."]
[]
[]
[null,null,"       Note:  These spreadsheets do allow for increased flow for flushing as required by some regulatotory authorities."]
[null,null,"                 For more comprehensive flushing velocity head losses please see Geoflow's Flow and Flush Spreadsheet."]
[]
[null,null,"Should you have any questions, please call 800-828-3388 9am - 5pm Pacific time, or call your local representative."]
[null,null,"www.geoflow.com"]
[]
[null,null,"Updates to this spreadsheet are regularly available at www.geoflow.com"]

{"sheet":"Macros","index":1,"n_rows":285,"n_cols":26,"rows_kept":285,"cut":false,"hidden":true,"merged":[[133,4,134,4],[266,7,266,13],[267,7,267,13],[268,7,268,13],[262,7,262,13],[263,7,263,13],[264,7,264,13],[265,7,265,13],[258,7,258,13],[259,7,259,13],[260,7,260,13],[261,7,261,13],[268,0,268,6],[263,0,263,6],[264,0,264,6],[265,0,265,6],[266,0,266,6],[258,0,258,6],[259,0,259,6],[267,0,267,6],[262,0,262,6],[261,0,261,6],[260,0,260,6]]}
["MACROS - DO NOT CHANGE THE DATA ON THIS FORM. THIS DATA IS USED IN YOUR WORKSHEET!"]
[]
["Dripline Box",null,null,null,null,"E24 Dripline Multizone Column",null,null,null,"D21 Dripline Spacing Box"]
["Wasteflow Classic",null,null,null,null,{"$f":"IF('Worksht1 - Field Flow'!$E$25=2,\"Wasteflow PC 1/2 gph\",F5)","v":"Consult factory"},null,null,null,1,"0.5 ft.",2]
["Wasteflow PC - 1/2gph",null,null,null,null,{"$f":"IF('Worksht1 - Field Flow'!$E$25=3,\"Wasteflow PC 1 gph\",F6)","v":"Consult factory"},null,null,null,2,"1 ft.",{"$f":"IF(L4=2,1,L6)","v":1}]
["Wasteflow PC - 1 gph",null,null,null,null,"Consult factory",null,null,null,3,"1.5 ft.",{"$f":"IF(L4=3,1.5,L7)","v":"Consult factory"}]
[null,null,null,null,null,null,null,null,null,4,"2 ft.",{"$f":"IF(L4=4,2,L8)","v":"Consult factory"}]
["D26 Pressure",null,null,null,null,null,null,null,null,null,null,"Consult factory"]
[1,10,3]
[2,15,{"$f":"IF(Macros!$C$9=2,15,C11)","v":20}]
[3,20,{"$f":"IF(Macros!$C$9=3,20,C12)","v":20}]
[4,25,{"$f":"IF(Macros!$C$9=4,25,C13)","v":"Consult factory"}]
[5,30,{"$f":"IF(Macros!$C$9=5,30,C14)","v":"Consult factory"}]
[6,35,{"$f":"IF(Macros!$C$9=6,35,C15)","v":"Consult factory"}]
[7,40,{"$f":"IF(Macros!$C$9=7,40,C16)","v":"Consult factory"}]
[8,45,{"$f":"IF(Macros!$C$9=8,45,C17)","v":"Consult factory"}]
[null,null,"Consult factory"]
[]
[]
["A28 Emitter Flow Rate"]
[{"$f":"IF('Worksht1 - Field Flow'!$E$25=A4,B21,A22)","v":"Check dripline tables"},{"$f":"IF('Worksht1 - Field Flow'!E30=10,0.81,C21)","v":1.1599999999999999},{"$f":"IF('Worksht1 - Field Flow'!E30=15,1,D21)","v":1.1599999999999999},{"$f":"IF('Worksht1 - Field Flow'!E30=20,1.16,E21)","v":1.1599999999999999},{"$f":"IF('Worksht1 - Field Flow'!E30=25,1.31,F21)","v":"Call Geoflow"},{"$f":"IF('Worksht1 - Field Flow'!E30=30,1.44,G21)","v":"Call Geoflow"},{"$f":"IF('Worksht1 - Field Flow'!E30=35,1.57,H21)","v":"Call Geoflow"},{"$f":"IF('Worksht1 - Field Flow'!E30=40,1.68,I21)","v":"Call Geoflow"},{"$f":"IF('Worksht1 - Field Flow'!E30=45,1.8,J21)","v":"Call Geoflow"},{"$f":"IF('Worksht1 - Field Flow'!E30=50,1.92,K21)","v":"Call Geoflow"},"Call Geoflow"]
[{"$f":"IF('Worksht1 - Field Flow'!E25=A6,1.02,A23)","v":"Check dripline tables"}]
["Check dripline tables"]
[]
["E31 Multizone Pipe size"]
[{"$f":"IF('Worksht2 - Pump Sizing'!D18<=3.999,\".5\",A27)","v":".5"},{"$f":"IF('Worksht2 - Pump Sizing'!D17<=3.999,\".5\",B27)","v":".5"},null,null,"PMR 15",15]
[{"$f":"IF('Worksht2 - Pump Sizing'!D18<=5,\".75\",A28)","v":".75"},{"$f":"IF('Worksht2 - Pump Sizing'!D17<=5,\".75\",B28)","v":".75"},null,null,"PMR 20",20]
[{"$f":"IF('Worksht2 - Pump Sizing'!D18<=10,\"1\",A29)","v":"1"},{"$f":"IF('Worksht2 - Pump Sizing'!D17<=10,\"1\",B29)","v":"1"},null,null,"PMR 25",25]
[{"$f":"IF('Worksht2 - Pump Sizing'!D18<=20,\"1.25\",A30)","v":"1.25"},{"$f":"IF('Worksht2 - Pump Sizing'!D17<=20,\"1.25\",B30)","v":"1.25"},null,null,"PMR 30",30]
[{"$f":"IF('Worksht2 - Pump Sizing'!D18<=30,\"1.5\",A31)","v":"1.5"},{"$f":"IF('Worksht2 - Pump Sizing'!D17<=30,\"1.5\",B31)","v":"1.5"},null,null,"PMR 35",35]
{"$rows_left_out":256}
{"sheet":"Worksht1 - Field Flow","index":2,"n_rows":161,"n_cols":24,"rows_kept":161,"cut":false,"hidden":false,"merged":[[24,6,25,6],[6,1,6,5],[18,1,18,3],[1,1,1,5],[23,2,23,3],[24,2,24,3],[13,2,13,3],[14,2,14,3],[21,2,21,3],[20,2,20,3],[12,1,12,5],[24,5,25,5],[24,4,25,4],[22,2,22,3],[24,1,25,1],[16,2,16,3],[32,2,32,3],[2,3,2,5],[3,3,3,5],[4,3,4,5],[5,3,5,5],[31,2,31,3],[29,2,29,3],[30,2,30,3],[7,1,7,5],[11,1,11,5]]}
[null,null,null,null,null,{"$f":"+Intro.!P4","v":"Updated Jan. 2015"}]
[null,"FIELD FLOW"]
[null,"Job Description:",null,"Fill in Job Site"]
[null,"Contact:",null,"Fill in Customer name"]
[null,"Prepared by:",null,"Fill in Designer name, email, phone"]
[null,"Date:",null,"Fill in date 7/31/2014"]
[]
[null,"Please fill in the shaded areas and drop down menus:"]
[null,"This spreadsheet is a guide for small systems with residential waste & is not a complete hydraulic design."]
[]
[null,"Worksheet 1- Field Flow"]
[]
[null,"Total field"]
[null,null,"Total Quantity of effluent to be disposed per day",null,2500,"gallons / day","note"]
[null,null,"Hydraulic loading rate",null,0.1,"gallons / sq.ft. / day","note"]
[null,null,"Minimum Dispersal Field Area",null,{"$f":"SUM(E14/E15)","v":25000},"square ft.","note",null,null,null,null,null,null,"Optional section for uneven zone sizes"]
[null,null,"Total Dispersal Field Area",null,636,"square ft.","note",null,null,null,null,null,null,{"$f":"+E25","v":"Wasteflow PC - 1/2gph"},"Zone #1","Zone #2","Zone 3","Zone 4","Zone 5","Zone 6","Zone 7","Zone 8","Zone 9","Zone 10"]
[null,"Flow per zone",null,null,null,null,null,null,null,null,null,null,null,"Dispersal Area per zone (sq ft.)","Fill in","Fill in","Fill in","Fill in","Fill in","Fill in","Fill in","Fill in","Fill in","Fill in"]
[null,"    Number of Zones",null,null,1,"zone(s)","note",null,null,null,null,null,null,"Line spacing",{"$f":"$E$21","v":2},{"$f":"$E$21","v":2},2,2,2,2,2,2,2,2]
[null,null,"Dispersal area per zone",null,{"$f":"SUM(E17/E19)","v":636},"square ft.","note",null,null,null,null,null,null,"Emitter spacing",{"$f":"$E$22","v":2},{"$f":"$E$22","v":2},2,2,2,2,2,2,2,2]
[null,null,"Choose line spacing between WASTEFLOW lines",null,2,"ft.","note",null,null,null,null,null,null,"Linear ft",{"$f":"+O18/O19","v":{"$error":"#VALUE!"}},{"$f":"+P18/P19","v":{"$error":"#VALUE!"}},{"$error":"#VALUE!"},{"$error":"#VALUE!"},{"$error":"#VALUE!"},{"$error":"#VALUE!"},{"$error":"#VALUE!"},{"$error":"#VALUE!"},{"$error":"#VALUE!"},{"$f":"+X18/X19","v":{"$error":"#VALUE!"}}]
[null,null,"Choose emitter spacing between WASTEFLOW emitters",null,2,"ft.","note",null,null,null,null,null,null,"No. of emitters per zone",{"$f":"+O21/O20","v":{"$error":"#VALUE!"}},{"$f":"+P21/P20","v":{"$error":"#VALUE!"}},{"$error":"#VALUE!"},{"$error":"#VALUE!"},{"$error":"#VALUE!"},{"$error":"#VALUE!"},{"$error":"#VALUE!"},{"$error":"#VALUE!"},{"$error":"#VALUE!"},{"$error":"#VALUE!"}]
[null,null,"Total linear ft.per zone (minimum required)",null,{"$f":"SUM(E20/E21)","v":318},"ft. per zone","note",null,null,null,null,null,null,"Select dripline",{"$f":"+$N$17","v":"Wasteflow PC - 1/2gph"},"Wasteflow PC - 1/2gph","Wasteflow PC - 1/2gph","Wasteflow PC - 1/2gph","Wasteflow PC - 1/2gph","Wasteflow PC - 1/2gph","Wasteflow PC - 1/2gph","Wasteflow PC - 1/2gph","Wasteflow PC - 1/2gph","Wasteflow PC - 1/2gph"]
[null,null,"Total number of emitters per zone",null,{"$f":"E23/E22","v":159},"emitters per zone","note"]
[null,null,"Select Wasteflow dripline (16mm)",null,"Wasteflow PC - 1/2gph","dripline","note"]
[null,null,null,null,null,null,null,null,null,null,null,"BioDisc-150",{"$f":"+'Worksht1 - Field Flow'!I48","v":"-"}]
[null,null,null,null,{"$f":"Macros!A4","v":"Wasteflow Classic"},null,null,null,null,null,null,"BioDisc-200",{"$f":"+'Worksht1 - Field Flow'!#REF!","v":{"$error":"#REF!"}}]
[null,null,null,null,{"$f":"Macros!A5","v":"Wasteflow PC - 1/2gph"},null,null,null,null,null,null,null,null,"Pressure at the beginning of zone",{"$f":"$E$30","v":20},{"$f":"$E$30","v":20},20,20,20,20,20,20,20,20]
[null,null,null,null,{"$f":"Macros!A6","v":"Wasteflow PC - 1 gph"},null,null,null,null,null,null,null,null,"Ft of head at beginning of zone",{"$f":"$E$31","v":46.2},{"$f":"$E$31","v":46.2},46.2,46.2,46.2,46.2,46.2,46.2,46.2,46.2]
[null,null,"Pressure at the beginning of the dripfield",null,20,"psi","note",null,null,null,null,null,null,"Flow rate per emitter in gph",{"$f":"IF(O23=Macros!$A$5,0.53,Macros!$A$21)","v":0.53},{"$f":"IF(P23=Macros!$A$5,0.53,Macros!$A$21)","v":0.53},{"$f":"IF(Q23=Macros!$A$5,0.53,Macros!$A$21)","v":0.53},{"$f":"IF(R23=Macros!$A$5,0.53,Macros!$A$21)","v":0.53},{"$f":"IF(S23=Macros!$A$5,0.53,Macros!$A$21)","v":0.53},{"$f":"IF(T23=Macros!$A$5,0.53,Macros!$A$21)","v":0.53},{"$f":"IF(U23=Macros!$A$5,0.53,Macros!$A$21)","v":0.53},{"$f":"IF(V23=Macros!$A$5,0.53,Macros!$A$21)","v":0.53},{"$f":"IF(W23=Macros!$A$5,0.53,Macros!$A$21)","v":0.53},{"$f":"IF(X23=Macros!$A$5,0.53,Macros!$A$21)","v":0.53}]
{"$rows_left_out":132}
{"sheet":"Worksht2 - Pump Sizing","index":3,"n_rows":169,"n_cols":9,"rows_kept":169,"cut":false,"hidden":false,"merged":[[26,3,26,4],[51,3,51,4],[25,3,25,4],[1,0,1,6],[12,0,12,6],[5,0,5,2],[6,0,6,2],[11,0,11,2],[16,1,16,2],[17,1,17,2],[7,1,7,5],[52,1,52,2],[57,1,57,2],[65,1,65,2],[59,1,59,2],[60,1,60,2]]}
[null,null,null,null,null,null,null,null,{"$f":"Intro.!P4","v":"Updated Jan. 2015"}]
["PUMP SIZING"]
["Job Description:",null,null,{"$f":"+'Worksht1 - Field Flow'!D3","v":"Fill in Job Site"}]
["Contact:",null,null,{"$f":"+'Worksht1 - Field Flow'!D4","v":"Fill in Customer name"}]
["Prepared by:",null,null,{"$f":"+'Worksht1 - Field Flow'!D5","v":"Fill in Designer name, email, phone"}]
["Date:",null,null,{"$f":"'Worksht1 - Field Flow'!D6","v":"Fill in date 7/31/2014"}]
[]
[null,{"$f":"+'Worksht1 - Field Flow'!B8:F8","v":"Please fill in the shaded areas and drop down menus:"}]
[null,{"$f":"+'Worksht1 - Field Flow'!B9","v":"This spreadsheet is a guide for small systems with residential waste & is not a complete hydraulic design."}]
[null,"Pressure losses may be grossly overstated, particularly if designing with WASTEFLOW Classic"]
[null,"The letters on the diagram(right) match the letters in section 2 below.  "]
[]
["Worksheet - Pump Sizing"]
[]
["Section 1 - Summary from Worksheet 1"]
[null,"Flow required to dose field",null,{"$f":"+'Worksht1 - Field Flow'!E33","v":1.4045000000000001},"gpm"]
[null,"Flow required to flush field",null,{"$f":"+'Worksht1 - Field Flow'!E42","v":1.4801829166666671},"gpm"]
[null,"Flow required to dose & flush field",null,{"$f":"+'Worksht1 - Field Flow'!E43","v":2.8846829166666672},"gpm"]
[null,"Filter",null,null,{"$f":"'Worksht1 - Field Flow'!E46","v":"Select filter above"}]
[null,"No. of Zones",null,{"$f":"'Worksht1 - Field Flow'!E19","v":1},"zones"]
[null,"Zone valve",null,null,{"$f":"'Worksht1 - Field Flow'!E48","v":0}]
[null,"Dripline",null,null,{"$f":"+Macros!G204","v":"Wasteflow PC - 1/2gph"}]
[null,"Dripline longest lateral",null,{"$f":"+'Worksht1 - Field Flow'!E39","v":318},"ft.",null,null,{"$f":"+'Worksht1 - Field Flow'!L39","v":0}]
[]
["Section 2",null,null,null,"Ft of head       ",null,"Pressure   "]
["A.  Flush line - Losses through return line"]
[null,null,"Select  Pipe from dropdown menu","PVC schedule 40"]
[null,null,"Select Flush Line Diameter","1/2\"","inch"]
[null,null,"Length of return line",172,"ft."]
[null,null,"Equivalent length of fittings",5,"ft."]
{"$rows_left_out":140}
{"sheet":"Parts List ","index":4,"n_rows":228,"n_cols":23,"rows_kept":228,"cut":false,"hidden":false,"merged":[[1,0,1,6],[2,2,2,6],[3,2,3,6],[4,2,4,6],[2,0,2,1],[3,0,3,1],[4,0,4,1],[11,0,11,6],[5,0,5,1],[21,0,21,5],[38,0,38,5],[30,0,30,5],[23,0,23,5],[19,0,19,5],[5,2,5,6],[13,4,13,5],[32,0,32,5],[12,4,12,5],[36,0,36,5],[28,0,28,5],[17,4,17,5],[15,4,15,5],[18,4,18,5],[57,4,57,5],[56,4,56,5],[55,4,55,5],[49,4,49,5],[52,0,52,5],[53,6,54,6],[53,7,54,7],[14,0,14,5],[16,0,16,5],[40,4,40,5]]}
[]
["GEOFLOW PARTS LIST",null,null,null,null,null,null,null,{"$f":"Intro.!P4","v":"Updated Jan. 2015"}]
["Job Description:",null,{"$f":"+'Worksht1 - Field Flow'!D3:F3","v":{"$error":"#VALUE!"}}]
["Contact:",null,{"$f":"+'Worksht1 - Field Flow'!D4:F4","v":{"$error":"#VALUE!"}}]
["Prepared by:",null,{"$f":"+'Worksht1 - Field Flow'!D5:F5","v":{"$error":"#VALUE!"}}]
["Date:",null,{"$f":"+'Worksht1 - Field Flow'!D6:F6","v":{"$error":"#VALUE!"}}]
[]
["Some of the following parts list will \"self fill\" as a guide and should not be construed as a complete parts list. Check item numbers and quantities against design layout."]
["Most \"Item Number\" cells have a drop down menu to select from.  Just click mouse on the desired cell to find dropdown arrow"]
["Recommended list prices are subject to change. For actual prices contact your local Geoflow dealer"]
["Prices for large systems may be overstated in this scenario"]
["Worksheet 3 - Parts List"]
[]
["Qty","Units","Item Number",null,"Description"]
["Dripline"]
[{"$f":"+'Worksht1 - Field Flow'!E23*'Worksht1 - Field Flow'!E19","v":318},"ft.",{"$f":"IF('Worksht1 - Field Flow'!E25= Macros!A4,Macros!A115,Macros!B115)","v":"WFPC16-2-24"},null,{"$f":"+IF(C16=\"WF 16 4 06\",\"Wasteflow Classic - 1 gph, 6in. Emitter spacing\",Macros!D115)","v":"Wasteflow PC . 1/2gph, 24in. emitter spacing"}]
["Airvent and box"]
[{"$f":"+'Worksht1 - Field Flow'!E19*2","v":2},"ea.","APVBK-1",null,{"$f":"IF(C18=B146,C146,D147)","v":"1\" airvent for use on zones less than 50gpm"}]
[{"$f":"+A18","v":2},"ea.","AV BOX 6 inch",null,{"$f":"IF(C19=B148,C148,C149)","v":"6\" round box"}]
["Pressure Regulators - Use to keep pressure from being too high"]
[{"$f":"+'Worksht1 - Field Flow'!E19","v":1},"ea.","Select",null,{"$f":"IF(C21=B151,C151,F152)","v":"Restricts pressure from exceeding required pressure. Required with Classic dripline."}]
["Controllers"]
[1,"ea.",null,null,{"$f":"E71","v":"Select Controller from list left"}]
["Pre-assembled Headworks"]
["Select from cell with",null,{"$f":"+'Worksht1 - Field Flow'!E45","v":"Select Filter"},null,null,null,null,null,null,{"$f":"IF('Worksht2 - Pump Sizing'!$E$19=\"Select filter\",\"-\",'Worksht2 - Pump Sizing'!$E$19)","v":"Select filter above"}]
[{"$f":"IF(C25=\"Vortex Screen Filter\",1,0)","v":0},{"$f":"IF(A26=1,\"ea.\",\"-\")","v":"-"},"   WHWS-V-1F-A",null,{"$f":"IF(AND($J$25=B133,B134,B135,B136),\"Select Vortex Headworks here\",E93)","v":"Sporty Headworks box & guts with 1\" Vortex Filter. Automatic flush"}]
[{"$f":"IF(C25=\"BioDisc filter\",1,0)","v":0},{"$f":"IF(A27=1,\"ea.\",\"-\")","v":"-"},"BIODISC Filter Headworks",null,{"$f":"IF(AND($J$25=B137,B138),E112,E113)","v":"-"}]
[{"$f":"IF(C25=\"GeoVac Screen Filter\",1,0)","v":0},{"$f":"IF(A28=1,\"ea.\",\"-\")","v":"-"},"GEOVAC filter Headworks",null,{"$f":"IF(AND($J$25=B139,B140,B141,B142,B143),\"Select GeoVac Headworks here\",E126)","v":"-"}]
["*    Solenoid Flush valves - Select only if Headworks is not selected above"]
[null,"ea.","SVLV-B-100",null,{"$f":"IF($C$30=B169,C169,G170)","v":"Flush valves"}]
{"$rows_left_out":199}
{"sheet":"T1-Dripline","index":5,"n_rows":176,"n_cols":15,"rows_kept":176,"cut":false,"hidden":false,"merged":[[103,2,103,6],[104,2,104,6],[45,2,45,6],[46,2,46,6],[18,2,18,5],[19,2,19,5],[74,2,74,6],[75,2,75,6]]}
[null,"Dripline Tables"]
[null,"Refer to Geoflow's Flow and flushing worksheet for further hydraulic details"]
[]
[null,"Wasteflow Classic"]
[]
[null,null,"Flow Rate vs. Pressure"]
[]
[null,null,"                 Pressure",null,"                  Dripline"]
[null,null,"psi","ft.","WF16-4-24","WF16-4-12"]
[null,null,"10 psi","23.10 ft","0.90 gph","0.90 gph"]
[null,null,"15 psi","34.65 ft.","1.13 gph","1.13 gph"]
[null,null,"20 psi","46.20 ft.","1.30gph","1.30gph"]
[null,null,"25 psi","57.75 ft.","1.47 gph","1.47 gph"]
[null,null,"30 psi","69.30 ft.","1.62 gph","1.62 gph"]
[null,null,"35 psi","80.85 ft.","1.76 gph","1.76 gph"]
[null,null,"40 psi","92.40 ft"]
[null,null,"45 psi","103.95 ft","1.89 gph","1.89 gph"]
[]
[null,null,"Maximum Length of Run vs. Pressure"]
[null,null,"Flow variation +/- 5%.  "]
[null,null,"                 Pressure",null,"                        Emitter Spacing"]
[null,null,"psi","ft.","24\"","18\"","12\""]
[null,null,"10 psi","23.10 ft",170,165,100]
[null,null,"15 psi","34.65 ft.",170,165,100]
[null,null,"20 psi","46.20 ft.",170,165,100]
[null,null,"25 psi","57.75 ft.",170,165,100]
[null,null,"30 psi","69.30 ft.",170,165,100]
[null,null,"35 psi","80.85 ft.",170,165,100]
[null,null,"40 psi","92.40 ft",170,165,100]
[null,null,"45 psi","103.95 ft",170,165,100]
{"$rows_left_out":147}
{"sheet":"T2-Filter & Headworks","index":6,"n_rows":135,"n_cols":8,"rows_kept":135,"cut":false,"hidden":false,"merged":[]}
[]
[null,"Vortex Filters and Headworks",null,null,null,null,null,"BioDisc Filters and Headworks"]
[]
[]
[]
[]
[]
[]
[]
[]
[]
[]
[]
[]
[]
[]
[]
[]
[]
[]
[]
[]
[]
[]
[]
[]
[]
[]
[]
[]
{"$rows_left_out":106}
{"sheet":"T3-Valves","index":7,"n_rows":52,"n_cols":12,"rows_kept":52,"cut":false,"hidden":false,"merged":[[44,4,44,11],[45,4,45,5],[45,6,45,7],[45,8,45,9],[45,10,45,11]]}
[]
[null,"Solenoid valves"]
[null,"Part Numbers","Size"]
[null,"SVLVB-100","1\""]
[null,"SVLVB-150","1.5\""]
[null,"SVLVB-200","2\""]
[null,"SVLVB-300","3\""]
[]
[null,"Flow vs Pressure"]
[]
[]
[]
[]
[]
[]
[]
[]
[]
[]
[]
[]
[]
[]
[]
[]
[]
[]
[]
[]
[]
{"$rows_left_out":23}
{"sheet":"T4-PVC PLUS","index":8,"n_rows":156,"n_cols":23,"rows_kept":156,"cut":false,"hidden":false,"merged":[[116,2,116,5],[118,2,118,5],[111,2,111,5],[112,2,112,5],[113,2,113,5],[114,2,114,5],[115,2,115,5],[104,2,104,5],[107,2,107,5],[108,2,108,5],[109,2,109,5],[110,2,110,5],[98,2,98,5],[99,2,99,5],[100,2,100,5],[101,2,101,5],[102,2,102,5],[93,2,93,5],[94,2,94,5],[95,2,95,5],[96,2,96,5],[97,2,97,5],[79,3,79,16],[45,2,45,15],[46,2,47,2],[46,3,46,15],[76,2,76,16],[77,2,77,16],[78,2,78,16],[4,21,4,22],[4,11,4,12],[4,13,4,14],[4,15,4,16],[4,17,4,18],[4,3,4,4],[4,5,4,6],[4,7,4,8],[4,9,4,10],[4,19,4,20]]}
[]
[null,null,"Schedule 40 PVC Plastic Pipe"]
[null,null,"(Pounds per square inch (PSI) per 100 ft. of pipe"]
[null,null,"The pipe is Schedule 40 ASTM D1785, D2672, D1784"]
[null,null,null,"         ½”",null,"¾”",null,"1”",null,"1 ¼”",null,"1 ½”",null,"2”",null,"2 ½”",null,"3”",null,"4”",null,"6”"]
[null,null,null,"Velocity","Pressure ","Velocity","Pressure ","Velocity","Pressure ","Velocity","Pressure ","Velocity","Pressure ","Velocity","Pressure ","Velocity","Pressure ","Velocity","Pressure ","Velocity","Pressure ","Velocity","Pressure "]
[null,null,null,"FPS","Drop PSI","FPS","Drop PSI","FPS","Drop PSI","FPS","Drop PSI","FPS","Drop PSI","FPS","Drop PSI","FPS","Drop PSI","FPS","Drop PSI","FPS","Drop PSI","FPS","Drop PSI"]
[null,null,"Flow"]
[null,null,"GPM"]
[null,null,1,1.05,0.43,0.6,0.11,0.37,0.03]
[null,null,2,2.11,1.55,1.2,0.39,0.74,0.12,0.43,0.03]
[null,null,3,3.17,3.27,1.8,0.83,1.1100000000000001,0.26,0.64,7.0000000000000007E-2,0.47,0.03]
[null,null,4,4.22,5.57,2.41,1.42,1.48,0.44,0.86,0.11,0.63,0.05]
[null,null,5,5.28,8.42,3.01,2.15,1.86,0.66,1.07,0.17,0.79,0.08]
[null,null,6,6.33,11.81,3.61,3.01,2.23,0.93,1.29,0.24,0.95,0.11,0.56999999999999995,0.03]
[null,null,8,8.44,20.100000000000001,4.8099999999999996,5.12,2.97,1.58,1.72,0.42,1.26,0.2,0.76,0.06,0.54,0.02]
[null,null,10,10.55,30.37,6.02,7.73,3.71,2.39,2.15,0.63,1.58,0.3,0.96,0.09,0.67,0.04]
[null,null,15,null,null,9.02,16.37,5.57,5.0599999999999996,3.22,1.33,2.36,0.63,1.43,0.19,1.01,0.08,0.65,0.03]
[null,null,20,null,null,null,null,7.42,8.61,4.29,2.27,3.15,1.07,1.91,0.32,1.34,0.13,0.87,0.05]
[null,null,25,null,null,null,null,9.2799999999999994,13.01,5.36,3.42,3.94,1.63,2.39,0.48,1.67,0.2,1.08,7.0000000000000007E-2]
[null,null,30,null,null,null,null,11.14,18.22,6.43,4.8,4.7300000000000004,2.27,2.87,0.67,2.0099999999999998,0.28000000000000003,1.3,0.1]
[null,null,35,null,null,null,null,null,null,7.51,6.38,5.52,3.01,3.35,0.89,2.35,0.38,1.52,0.13,0.88,0.03]
[null,null,40,null,null,null,null,null,null,8.58,8.17,6.3,3.88,3.82,1.1399999999999999,2.64,0.48,1.73,0.17,1.01,0.04]
[null,null,45,null,null,null,null,null,null,9.65,10.16,7.09,4.8,4.3,1.42,3.01,0.6,1.95,0.21,1.1299999999999999,0.05]
[null,null,50,null,null,null,null,null,null,10.72,12.35,7.88,5.83,4.78,1.73,3.35,0.73,2.17,0.25,1.26,7.0000000000000007E-2]
[null,null,60,null,null,null,null,null,null,null,null,9.4600000000000009,8.17,5.74,2.42,4.0199999999999996,1.02,2.6,0.35,1.51,0.09]
[null,null,70,null,null,null,null,null,null,null,null,11.03,10.87,6.69,3.22,4.6900000000000004,1.36,3.04,0.47,1.76,0.12]
[null,null,80,null,null,null,null,null,null,null,null,null,null,7.65,4.13,5.36,1.74,3.47,0.6,2.02,0.16]
[null,null,90,null,null,null,null,null,null,null,null,null,null,8.6,5.13,6.03,2.16,3.91,0.75,2.27,0.2]
[null,null,100,null,null,null,null,null,null,null,null,null,null,9.56,6.23,6.7,2.63,4.34,0.91,2.52,0.24,1.1100000000000001,0.03]
{"$rows_left_out":127}
{"sheet":"T5-Flow meter","index":9,"n_rows":2,"n_cols":3,"rows_kept":2,"cut":false,"hidden":false,"merged":[]}
[]
[null,null,"FLOW METER"]